{"text_format":"1","workbook":"xlsx","n_sheets":7,"sheets":["College Worksheet","Committed Changes","DL Apr17","CAM Allowances","FTE Lookup","2016-26 Enrollment Projection","College Name Lookup"],"not_rendered":{"charts":0,"images":0,"macros":1,"external_links":2,"defined_names":11,"comments":0,"pivot_tables":0},"unopened":[],"bounds":{"document_bytes":16777216,"sheet_cells":100000,"rows_first":2000,"rows_last":500,"rows_between":2000,"halvings":0,"cell_chars":16384,"cell_head_chars":4096},"cells_cut":0,"cells_raw":0,"read":"whole","date_system":"1900"}

{"sheet":"College Worksheet","index":0,"n_rows":60,"n_cols":14,"rows_kept":60,"cut":false,"hidden":false,"merged":[]}
["Preliminary for 2019-21 Project Requests"]
["CAPITAL ANALYSIS MODEL (CAM) GENERATED SPACE"]
["DirectLine inventory data April 2017",null,null,null,null,null,null,null,null,null,"Warning: do not use before ~"]
["COLLEGE:","Seattle Central",null,null,null,null,null,null,null,null,"College breaks out assignable areas by CAM category for their projects on the Committed Changes tab."]
["TYPE:",{"$f":"VLOOKUP(B4,'College Name Lookup'!E1:F36,2,0)","v":"Community College"},null,null,null,null,null,null,null,null,"College verfies assignaable area by CAM category on the DL Inventory tab."]
[]
["All FTE *","FALL 2014","FALL 2024","Growth","Percent","FTE/Year"]
["Academic",{"$f":"VLOOKUP(CONCATENATE($B$4,\" \",$A8),'FTE Lookup'!$B$11:$L$118,3,0)","v":3123.7967410003039},{"$f":"VLOOKUP(CONCATENATE($B$4,\" \",$A8),'FTE Lookup'!$B$11:$L$118,6,0)","v":3326},{"$f":"C8-B8","v":202.20325899969612},{"$f":"IF(B8=0,0,(C8/B8)-1)","v":6.4729966692694152E-2},{"$f":"D8/10","v":20.220325899969612}]
["Vocational",{"$f":"VLOOKUP(CONCATENATE($B$4,\" \",$A9),'FTE Lookup'!$B$11:$L$118,3,0)","v":1500.224835000048},{"$f":"VLOOKUP(CONCATENATE($B$4,\" \",$A9),'FTE Lookup'!$B$11:$L$118,6,0)","v":1597},{"$f":"C9-B9","v":96.77516499995204},{"$f":"IF(B9=0,0,(C9/B9)-1)","v":6.4507107696260002E-2},{"$f":"D9/10","v":9.6775164999952032}]
["Basic Skills/Dev Ed",{"$f":"VLOOKUP(CONCATENATE($B$4,\" \",$A10),'FTE Lookup'!$B$11:$L$118,3,0)","v":1450.2912560000498},{"$f":"VLOOKUP(CONCATENATE($B$4,\" \",$A10),'FTE Lookup'!$B$11:$L$118,6,0)","v":1544},{"$f":"C10-B10","v":93.708743999950229},{"$f":"IF(B10=0,0,(C10/B10)-1)","v":6.4613741282838477E-2},{"$f":"D10/10","v":9.3708743999950226}]
["TOTAL",{"$f":"SUM(B8:B10)","v":6074.3128320004016},{"$f":"SUM(C8:C10)","v":6467},{"$f":"C11-B11","v":392.68716799959839},{"$f":"IF(B11=0,0,(C11/B11)-1)","v":6.4647175550601066E-2},{"$f":"D11/10","v":39.26871679995984}]
[]
["Type 1 FTE","FALL 2014","FALL 2024","Growth","Percent","FTE/Year"]
["Academic",{"$f":"VLOOKUP(CONCATENATE($B$4,\" \",$A14),'FTE Lookup'!$B$11:$L$118,4,0)","v":2394.0708040002082},{"$f":"VLOOKUP(CONCATENATE($B$4,\" \",$A14),'FTE Lookup'!$B$11:$L$118,7,0)","v":2549},{"$f":"C14-B14","v":154.92919599979177},{"$f":"IF(B14=0,0,(C14/B14)-1)","v":6.471370677129662E-2},{"$f":"D14/10","v":15.492919599979178}]
["Vocational",{"$f":"VLOOKUP(CONCATENATE($B$4,\" \",$A15),'FTE Lookup'!$B$11:$L$118,4,0)","v":1128.3318630000185},{"$f":"VLOOKUP(CONCATENATE($B$4,\" \",$A15),'FTE Lookup'!$B$11:$L$118,7,0)","v":1201},{"$f":"C15-B15","v":72.668136999981471},{"$f":"IF(B15=0,0,(C15/B15)-1)","v":6.4403159551633005E-2},{"$f":"D15/10","v":7.2668136999981474}]
["Basic Skills/Dev Ed",{"$f":"VLOOKUP(CONCATENATE($B$4,\" \",$A16),'FTE Lookup'!$B$11:$L$118,4,0)","v":983.10532200003115},{"$f":"VLOOKUP(CONCATENATE($B$4,\" \",$A16),'FTE Lookup'!$B$11:$L$118,7,0)","v":1047},{"$f":"C16-B16","v":63.894677999968849},{"$f":"IF(B16=0,0,(C16/B16)-1)","v":6.4992708888994111E-2},{"$f":"D16/10","v":6.3894677999968845}]
["TOTAL",{"$f":"SUM(B14:B16)","v":4505.507989000258},{"$f":"SUM(C14:C16)","v":4797},{"$f":"C17-B17","v":291.49201099974198},{"$f":"IF(B17=0,0,(C17/B17)-1)","v":6.4696813702559197E-2},{"$f":"D17/10","v":29.149201099974199}]
[]
["Type 2 FTE","FALL 2014","FALL 2024","Growth","Percent","FTE/Year"]
["Academic",{"$f":"VLOOKUP(CONCATENATE($B$4,\" \",$A20),'FTE Lookup'!$B$11:$L$118,5,0)","v":2730.0037970002581},{"$f":"VLOOKUP(CONCATENATE($B$4,\" \",$A20),'FTE Lookup'!$B$11:$L$118,8,0)","v":2907},{"$f":"C20-B20","v":176.99620299974185},{"$f":"IF(B20=0,0,(C20/B20)-1)","v":6.4833683819131016E-2},{"$f":"D20/10","v":17.699620299974185}]
{"$rows_left_out":41}
{"sheet":"Committed Changes","index":1,"n_rows":38,"n_cols":13,"rows_kept":38,"cut":false,"hidden":false,"merged":[[5,5,5,7],[5,8,5,9],[5,10,5,11]]}
[]
[null,"Committed Changes (Colleges need to break out assignable areas in their projects by CAM Category before using this workbook)"]
[]
[null,"Buildings in 2016 Facility Inventory System report that are in current and future pipeline projects, as of April 20, 2017"]
[]
[null,null,null," ",null,"Gross Square Feet",null,null,"UFI in 2016 FIS",null,"Name in 2016 FIS",null,"Projected"]
[null,"College","Project Name","Number","Status","Total","Replaced by Project","Renovated in Project","To be Replaced","To be Renovated","To be Replaced","To be Renovated","Occupancy Date"]
[null,"Bates","Mohler Communications Technology Center",20082703,"Construction funded in 2013-15",53009,null,null,null,null,null,null,"2015-04-01"]
[null,"Bates","Medical Mile Health Science Center",30000989,"Design resquested for 2017-19",70000,64859,null,"A08982",null,"WEST ANNEX - BLDG. B",null,"2021-07-01"]
[null,"Bellevue","Bellevue - Helath Science Bldg",20082702,"Construction funded in 2013-15",70646,null,null,null,null,null,null,"2015-01-01"]
[null,"Big Bend","Professional-Technical Education Center",30000981,"Design funded in 2015-17",76140,76549,null,"A00116, A06829, A06920, A07007, A07326",null,"MAINTENANCE MECHANICS PRO, AG.EDUCATION&ENGINEERING, AUTO MECHANICS, AIRFRAME & POWERPLANT, WELDING LAB",null,"2019-06-01"]
[null,"Cascadia","Center for Science and Technology",30001453,"Design resquested for 2017-19",66100,null,null,null,null,null,null,"2021-06-01"]
[null,"Centralia  ","Student Services",30000123,"Construction funded in 2015-17",70000,46432,null,"A01114, A06567",null,"STUDENT CENTER, KEMP HALL",null,"2017-07-01"]
[null,"Clark","Health and Advanced Technologies Building",20082705,"Construction funded in 2013-15",70000,null,null,null,null,null,null,"2015-06-01"]
[null,"Clark","North Clark County",30000135,"Design resquested for 2017-19",69000,null,null,null,null,null,null,"2021-10-01"]
[null,"Clover Park","Center for Advanced Manufacturing Technologies 2",30000984,"Design funded in 2015-17",62478,59331,null,"A01800",null,"AUXILIARY SERVICES",null,"2018-11-01"]
[null,"Columbia Basin  ","Social Science Center",20082704,"Construction funded in 2015-17",51335,null,null,null,null,null,null,"2016-08-01"]
[null,"Edmonds  ","Science Engineering Technology Bldg",30000137,"Design funded in 2015-17",69912,null,null,null,null,null,null,"2018-03-01"]
[null,"Everett","Learning Resource Center",30000136,"Design resquested for 2017-19",69630,null,null,null,null,null,null,"2021-02-01"]
[null,"Grays Harbor","Science and Math Building",20081226,"Construction funded in 2013-15",70325,14765,null,"A04995",null,"LIFSCI",null,"2015-08-01"]
{"$rows_left_out":19}
{"sheet":"DL Apr17","index":2,"n_rows":49,"n_cols":35,"rows_kept":49,"cut":false,"hidden":false,"merged":[[6,25,6,30],[6,3,6,4],[6,5,6,9],[6,10,6,13],[6,14,6,15],[6,18,6,19],[6,20,6,23]]}
[null,null,1,2,3,4,5,6,7,8,9,10,11,12,13,14,15,16,17,18,19,20,21,22,23,24,25,26,27,28,29,30,31,32,33]
[null,"Inventory breakdown by room use (Colleges need to verify assignable area by CAM category before using this wookbook)"]
[null,"State Board for Community and Technical Colleges"]
[null,"Owned Net Square Footage by Category Indicator"]
[null,"From DirectLine April 2017"]
[]
[null,null,null,"Classroom",null,"Laboratory",null,null,null,null,"Fine Arts",null,null,null,"Vocational",null,"Learning & Study Support","Faculty Work and Related","Institutional Student Service Administration",null,"Student Social and Cultural Development",null,null,null,"Supplies, Facilities, Grounds","Non-program Support",null,null,null,null,null,"Community Relations","Self Support","Coding Errors"]
[null,"DISTRICT","COLLEGE","A1","A2","B1","B2","B3","B4","B5","C1","C2","C3","C4","D1","D2","E1","F1","G1","G2","H1","H2","H3","H4","I1","J1","J2","J3","J4","J5","J6","K1","L1","Z","TOTAL"]
[null,10,"Peninsula",30919,4867,18980,12639,814,1785,4396,6758,4257,2992,451,29843,null,12024,14712,15374,1333,8332,84,11860,null,6806,null,null,25,37234,2576,null,1232,1815,90310,322418]
[null,20,"Grays Harbor",27037,659,4980,1575,2833,3273,null,null,2881,14409,9268,55385,88,15354,12583.5,16008.5,1227,16454,1540,14559.5,2522,15522.25,null,3530.65,1681.3,14313.84,null,null,825,null,79714,318223.53999999998]
[null,30,"Olympic",33484,null,14866,2689,1573,14561,4127,null,null,null,null,17022,2191,26849,13888,28984,2712,20791,null,13874,4161,11340,null,260,null,69041,2440,null,1064,null,70103,356020]
[null,40,"Skagit Valley",49058,2684,20407,3035,3542,2513,7808,12248,4387,5985,3689,65008,null,31963,19916,23383,5155,33028,652,57365,null,2698,null,1604,294,64786,733,null,1506,null,46494,476541]
[null,50,"Everett",9275,8975,16730,10944,2721,null,1677,10909,4712,3026,null,10517,1122,null,44650,1002,141,null,null,22243,null,264,null,null,null,181,null,null,null,null,479078,628167]
[null,62,"Seattle Central",90616,8760,13400,18238,3446,8405,1620,31861,2071,15998,1542,86448,null,43227,51352,90446,2459,44175,3382,33881,4692,48181,14287,null,null,210301,36538,null,1031,null,47022,917376]
[null,63,"Seattle North",39139,916,18699,912,3029,null,null,10136,5068,2869,120,11131,null,5445,14904,22325,558,14217,918,null,5441,4481,null,null,null,725,2814,null,1457,null,596101,761405]
[null,64,"Seattle South",5729,5939,8543,19197,4877,null,1106,6939,2793,null,null,188331,null,791,23160,7746,null,2240,null,3019,null,null,null,null,null,5477,462,null,null,null,368592,655133]
[null,65,"Seattle Voc Institute",null,null,null,6729,3446,null,null,null,null,null,null,9015,null,null,4078,null,null,null,null,null,null,null,null,null,null,null,null,null,null,null,76200,99468]
[null,70,"Shoreline",null,null,null,null,null,null,null,null,730,null,null,null,null,null,797,null,null,null,null,600,null,null,null,null,null,null,null,null,null,null,439074,441201]
[null,80,"Bellevue",81389,17122,48645,14753,7340,6279,3580,17504,13770,13085,2952,18410,2770,34379,46270,31689,8295,33219,1336,37935,19859,33922,1400,7023,17612,97740,4168,null,1571,null,241951,865968]
[null,90,"Highline",null,3735,11387,1395,2180,null,1720,5894,4686,5943,null,13080,null,null,10396,null,null,null,null,36947,null,null,null,null,null,null,null,null,null,null,467528,564891]
{"$rows_left_out":30}
{"sheet":"CAM Allowances","index":3,"n_rows":28,"n_cols":9,"rows_kept":28,"cut":false,"hidden":false,"merged":[[2,1,2,8],[11,3,11,8],[12,3,12,8],[13,3,13,8],[21,3,21,8],[5,1,6,1],[5,2,6,2],[5,3,5,4],[5,5,5,6],[5,7,5,8],[26,1,26,8],[27,1,27,8],[4,1,4,8],[22,1,22,8],[25,1,25,8],[23,2,23,8],[24,2,24,8]]}
[]
[]
[null,"Capital Asset Model, adopted February 7, 2013"]
[]
[null,"Assignable Square Feet per FTE Student"]
[null,"Type of Space","FTE Type","Academic FTE",null,"Vocational FTE",null,"Basic Skills FTE"]
[null,null,null,"First 1,000","Additional","First 1,000","Additional","First 1,000","Additional"]
[null,"General Classroom",1,12.4,12.4,7.5,7.5,"N/A","N/A"]
[null,"Basic Skills",2,"N/A","N/A","N/A","N/A",27.6,27.6]
[null,"Science Lab",1,6,6,3.5,3.5,"N/A","N/A"]
[null,"Computer Lab (open)",2,3.2,3.2,3.2,3.2,3.2,3.2]
[null,"Music",2,"A one-time allowance of 4,000 asf @ CCs only"]
[null,"Art",2,"A one-time allowance of 6,000 asf @ CCs only"]
[null,"Drama",2,"A one-time allowance of 5,000 asf @ CCs only"]
[null,"Physical Education **",2,26,10,"N/A","N/A","N/A","N/A"]
[null,"Library ***",2,16.8,8.5,16.8,8.5,16.8,8.5]
[null,"Faculty Office",2,8.1,8.1,10.8,10.8,8.1,8.1]
[null,"Admin/Student Services",2,8.98,5.13,8.98,5.13,8.98,5.13]
[null,"Student Center & Related",2,13.19,7.97,13.19,7.97,13.19,7.97]
[null,"Childcare",2,3.4,3.4,3.4,3.4,3.4,3.4]
{"$rows_left_out":9}
{"sheet":"FTE Lookup","index":4,"n_rows":126,"n_cols":12,"rows_kept":126,"cut":false,"hidden":false,"merged":[[8,3,8,5],[8,6,8,8],[8,9,8,11]]}
[null,1,2,3,4,5,6,7,8,9,10,11]
[]
[null,null,"WA State Board for Community and Technical Colleges"]
[null,null,"Summary of Fall FTEs Used in the 2019-21 CAM"]
[null,null,"CAM V01"]
[null,null,"EXCLUDING Department of Corrections (DOC)"]
[null,null,"Type 1 = Day On-Campus (excludes Online)"]
[null,null,"Type 2 = Day On-Campus + Online"]
[null,"Lookup","010","Fall 2012 FTEs",null,null,"Fall 2022 FTE Projections",null,null,"FTE Growth (Fall)"]
[null,"College","Intent","Total","Type 1","Type 2","Total","Type 1","Type 2","Total","Type 1","Type 2"]
[null,"Bates Academic","Academic",122.1998729999996,81.133249000000092,122.1998729999996,130,86,130,7.8001270000004013,4.8667509999999083,7.8001270000004013]
[null,"Bates Basic Skills/Dev Ed","Vocational",2385.1239980000619,1292.9117550000412,1500.2448850000587,2537,1375,1596,151.87600199993813,82.088244999958761,95.75511499994127]
[null,"Bates Vocational","Basic Skills/Dev Ed",509.72607899999389,334.03281799999877,345.03280699999823,542,355,367,32.273921000006112,20.96718200000123,21.967193000001771]
[null,"Bellevue Academic","Academic",7443.4393819965071,5139.308125999396,6850.9732549971932,7934,5478,7302,490.56061800349289,338.691874000604,451.02674500280682]
[null,"Bellevue Basic Skills/Dev Ed","Vocational",2495.2043050002053,1155.6320900000605,1704.0981450001209,2660,1232,1817,164.7956949997947,76.367909999939457,112.90185499987911]
[null,"Bellevue Vocational","Basic Skills/Dev Ed",1352.125568000002,1046.6592579999938,1093.392530999997,1441,1115,1165,88.874431999998023,68.34074200000623,71.607469000002993]
[null,"Bellingham Academic","Academic",402.79960699999515,219.13312400000194,353.46632299999754,433,236,380,30.200393000004851,16.866875999998058,26.533677000002456]
[null,"Bellingham Basic Skills/Dev Ed","Vocational",1558.217950000053,1113.0919040000338,1255.0916830000403,1674,1196,1348,115.78204999994705,82.908095999966235,92.908316999959652]
[null,"Bellingham Vocational","Basic Skills/Dev Ed",287.81966899999708,233.40638999999868,249.07304099999917,309,251,267,21.180331000002923,17.59361000000132,17.926959000000835]
[null,"Big Bend Academic","Academic",1113.365430000068,814.43237300003136,1016.3655260000595,1292,945,1179,178.63456999993195,130.56762699996864,162.6344739999405]
{"$rows_left_out":107}
{"sheet":"2016-26 Enrollment Projection","index":5,"n_rows":300,"n_cols":10,"rows_kept":300,"cut":false,"hidden":false,"merged":[[0,0,0,9],[1,0,1,9],[2,0,2,9],[3,0,3,9],[6,1,6,3],[6,4,6,6],[6,7,6,9],[30,1,30,3],[30,4,30,6],[30,7,30,9],[38,1,38,3],[38,4,38,6],[38,7,38,9],[14,1,14,3],[14,4,14,6],[14,7,14,9],[22,1,22,3],[22,4,22,6],[22,7,22,9],[62,1,62,3],[62,4,62,6],[62,7,62,9],[70,1,70,3],[70,4,70,6],[70,7,70,9],[46,1,46,3],[46,4,46,6],[46,7,46,9],[54,1,54,3],[54,4,54,6],[54,7,54,9],[94,1,94,3],[94,4,94,6],[94,7,94,9],[102,1,102,3],[102,4,102,6],[102,7,102,9],[78,1,78,3],[78,4,78,6],[78,7,78,9],[86,1,86,3],[86,4,86,6],[86,7,86,9],[126,1,126,3],[126,4,126,6],[126,7,126,9],[134,1,134,3],[134,4,134,6],[134,7,134,9],[110,1,110,3],[110,4,110,6],[110,7,110,9],[118,1,118,3],[118,4,118,6],[118,7,118,9],[158,1,158,3],[158,4,158,6],[158,7,158,9],[166,1,166,3],[166,4,166,6],[166,7,166,9],[142,1,142,3],[142,4,142,6],[142,7,142,9],[150,1,150,3],[150,4,150,6],[150,7,150,9],[190,1,190,3],[190,4,190,6],[190,7,190,9],[198,1,198,3],[198,4,198,6],[198,7,198,9],[174,1,174,3],[174,4,174,6],[174,7,174,9],[182,1,182,3],[182,4,182,6],[182,7,182,9],[222,1,222,3],[222,4,222,6],[222,7,222,9],[230,1,230,3],[230,4,230,6],[230,7,230,9],[206,1,206,3],[206,4,206,6],[206,7,206,9],[214,1,214,3],[214,4,214,6],[214,7,214,9],[254,1,254,3],[254,4,254,6],[254,7,254,9],[262,1,262,3],[262,4,262,6],[262,7,262,9],[238,1,238,3],[238,4,238,6],[238,7,238,9],[246,1,246,3],[246,4,246,6],[246,7,246,9],[286,1,286,3],[286,4,286,6],[286,7,286,9],[270,1,270,3],[270,4,270,6],[270,7,270,9],[278,1,278,3],[278,4,278,6],[278,7,278,9]]}
["WA State Board for Community and Technical Colleges"]
["Summary of Fall FTEs Used in the 2019-21 CAM"]
["CAM V01"]
["EXCLUDING Department of Corrections (DOC)"]
["Type 1 = Day On-Campus (excludes Online)"]
["Type 2 = Day On-Campus + Online"]
[null,"Fall 2016 FTEs",null,null,"Fall 2026 FTE Projections",null,null,"FTE Growth (Fall)"]
["Bates","Total","Type 1","Type 2","Total","Type 1","Type 2","Total","Type 1","Type 2"]
["Academic",122.1998729999996,81.133249000000092,122.1998729999996,130,86,130,7.8001270000004013,4.8667509999999083,7.8001270000004013]
["Vocational",2385.1239980000619,1292.9117550000412,1500.2448850000587,2537,1375,1596,151.87600199993813,82.088244999958761,95.75511499994127]
["Basic Skills/Dev Ed",509.72607899999389,334.03281799999877,345.03280699999823,542,355,367,32.273921000006112,20.96718200000123,21.967193000001771]
["   Total",3017.0499500000551,1708.0778220000402,1967.4775650000565,3209.127678684591,1816,2093,191.95004999994464,107.9221779999599,125.52243499994344]
[]
[]
[null,"Fall 2016 FTEs",null,null,"Fall 2026 FTE Projections",null,null,"FTE Growth (Fall)"]
["Bellevue","Total","Type 1","Type 2","Total","Type 1","Type 2","Total","Type 1","Type 2"]
["Academic",7443.4393819965071,5139.308125999396,6850.9732549971932,7934,5478,7302,490.56061800349289,338.691874000604,451.02674500280682]
["Vocational",2495.2043050002053,1155.6320900000605,1704.0981450001209,2660,1232,1817,164.7956949997947,76.367909999939457,112.90185499987911]
["Basic Skills/Dev Ed",1352.125568000002,1046.6592579999938,1093.392530999997,1441,1115,1165,88.874431999998023,68.34074200000623,71.607469000002993]
["   Total",11290.769254996714,7341.5994739994512,9648.4639309973118,12034.232187307391,7825,10284,744.23074500328562,483.40052600054969,635.53606900268892]
{"$rows_left_out":281}
{"sheet":"College Name Lookup","index":6,"n_rows":36,"n_cols":6,"rows_kept":36,"cut":false,"hidden":false,"merged":[]}
["COL","TITLE",null,"COL","TITLE","TYPE"]
["010","Peninsula",null,"280","Bates","Technical College"]
["020","Grays Harbor",null,"080","Bellevue","Community College"]
["030","Olympic",null,"250","Bellingham","Technical College"]
["040","Skagit Valley",null,"180","Big Bend","Community College"]
["050","Everett",null,"300","Cascadia","Community College"]
["062","Seattle Central",null,"121","Centralia","Community College"]
["063","Seattle North",null,"140","Clark","Community College"]
["064","Seattle South",null,"290","Clover Park","Technical College"]
["065","Seattle Voc Institute",null,"190","Columbia Basin","Community College"]
["070","Shoreline",null,"230","Edmonds","Community College"]
["080","Bellevue",null,"050","Everett","Community College"]
["090","Highline",null,"020","Grays Harbor","Community College"]
["100","Green River",null,"100","Green River","Community College"]
["111","Pierce Fort Steilacoom",null,"090","Highline","Community College"]
["112","Pierce Puyallup",null,"260","Lake Washington","Technical College"]
["121","Centralia",null,"130","Lower Columbia","Community College"]
["130","Lower Columbia",null,"030","Olympic","Community College"]
["140","Clark",null,"010","Peninsula","Community College"]
["150","Wenatchee Valley",null,"111","Pierce Fort Steilacoom","Community College"]
{"$rows_left_out":16}