{"text_format":"1","workbook":"xlsx","n_sheets":6,"sheets":["College Worksheet","Committed Changes","Inventory","CAM Allowances","FTE Lookup","College Name Lookup"],"not_rendered":{"charts":0,"images":0,"macros":1,"external_links":1,"defined_names":11,"comments":0,"pivot_tables":0},"unopened":[],"bounds":{"document_bytes":16777216,"sheet_cells":100000,"rows_first":2000,"rows_last":500,"rows_between":2000,"halvings":0,"cell_chars":16384,"cell_head_chars":4096},"cells_cut":0,"cells_raw":0,"read":"whole","date_system":"1900"}

{"sheet":"College Worksheet","index":0,"n_rows":60,"n_cols":14,"rows_kept":60,"cut":false,"hidden":false,"merged":[]}
["Preliminary for 2023-25 Project Requests"]
["CAPITAL ANALYSIS MODEL (CAM) GENERATED SPACE"]
["DirectLine inventory data from July 12, 2021",null,null,null,null,null,null,null,null,null,"Warning: do not use before ~"]
["COLLEGE:","Bellevue",null,null,null,null,null,null,null,null,"College breaks out assignable areas by CAM category for their projects on the Committed Changes tab and any other changes planned prior to 2029."]
["TYPE:",{"$f":"VLOOKUP(B4,'College Name Lookup'!E1:F36,2,0)","v":"Community College"},null,null,null,null,null,null,null,null,"College verfies assignaable area by CAM category on the Inventory tab."]
[]
["All FTE *","FALL 2019","FALL 2029","Growth","Percent","FTE/Year"]
["Academic",{"$f":"VLOOKUP(CONCATENATE($B$4,\" \",$A8),'FTE Lookup'!$B$11:$L$115,3,0)","v":6970.5602789970162},{"$f":"VLOOKUP(CONCATENATE($B$4,\" \",$A8),'FTE Lookup'!$B$11:$L$115,6,0)","v":7512},{"$f":"C8-B8","v":541.43972100298379},{"$f":"IF(B8=0,0,(C8/B8)-1)","v":7.7675208208785484E-2},{"$f":"D8/10","v":54.143972100298377}]
["Vocational",{"$f":"VLOOKUP(CONCATENATE($B$4,\" \",$A9),'FTE Lookup'!$B$11:$L$115,3,0)","v":2275.9844820001485},{"$f":"VLOOKUP(CONCATENATE($B$4,\" \",$A9),'FTE Lookup'!$B$11:$L$115,6,0)","v":2453},{"$f":"C9-B9","v":177.01551799985145},{"$f":"IF(B9=0,0,(C9/B9)-1)","v":7.7775362441965923E-2},{"$f":"D9/10","v":17.701551799985147}]
["Basic Skills/Dev Ed",{"$f":"VLOOKUP(CONCATENATE($B$4,\" \",$A10),'FTE Lookup'!$B$11:$L$115,3,0)","v":1246.3054120000372},{"$f":"VLOOKUP(CONCATENATE($B$4,\" \",$A10),'FTE Lookup'!$B$11:$L$115,6,0)","v":1343},{"$f":"C10-B10","v":96.694587999962778},{"$f":"IF(B10=0,0,(C10/B10)-1)","v":7.7584986046710602E-2},{"$f":"D10/10","v":9.6694587999962778}]
["TOTAL",{"$f":"SUM(B8:B10)","v":10492.850172997203},{"$f":"SUM(C8:C10)","v":11308},{"$f":"C11-B11","v":815.14982700279688},{"$f":"IF(B11=0,0,(C11/B11)-1)","v":7.7686216191339641E-2},{"$f":"D11/10","v":81.514982700279688}]
[]
["Type 1 FTE","FALL 2019","FALL 2029","Growth","Percent","FTE/Year"]
["Academic",{"$f":"VLOOKUP(CONCATENATE($B$4,\" \",$A14),'FTE Lookup'!$B$11:$L$115,4,0)","v":4784.0955459997012},{"$f":"VLOOKUP(CONCATENATE($B$4,\" \",$A14),'FTE Lookup'!$B$11:$L$115,7,0)","v":5156},{"$f":"C14-B14","v":371.90445400029876},{"$f":"IF(B14=0,0,(C14/B14)-1)","v":7.773767275849508E-2},{"$f":"D14/10","v":37.190445400029873}]
["Vocational",{"$f":"VLOOKUP(CONCATENATE($B$4,\" \",$A15),'FTE Lookup'!$B$11:$L$115,4,0)","v":1113.0522500000552},{"$f":"VLOOKUP(CONCATENATE($B$4,\" \",$A15),'FTE Lookup'!$B$11:$L$115,7,0)","v":1200},{"$f":"C15-B15","v":86.94774999994479},{"$f":"IF(B15=0,0,(C15/B15)-1)","v":7.8116503515392344E-2},{"$f":"D15/10","v":8.694774999994479}]
["Basic Skills/Dev Ed",{"$f":"VLOOKUP(CONCATENATE($B$4,\" \",$A16),'FTE Lookup'!$B$11:$L$115,4,0)","v":890.90575700002489},{"$f":"VLOOKUP(CONCATENATE($B$4,\" \",$A16),'FTE Lookup'!$B$11:$L$115,7,0)","v":960},{"$f":"C16-B16","v":69.094242999975108},{"$f":"IF(B16=0,0,(C16/B16)-1)","v":7.755505277307706E-2},{"$f":"D16/10","v":6.9094242999975108}]
["TOTAL",{"$f":"SUM(B14:B16)","v":6788.0535529997815},{"$f":"SUM(C14:C16)","v":7316},{"$f":"C17-B17","v":527.94644700021854},{"$f":"IF(B17=0,0,(C17/B17)-1)","v":7.7775822314617438E-2},{"$f":"D17/10","v":52.794644700021855}]
[]
["Type 2 FTE","FALL 2019","FALL 2029","Growth","Percent","FTE/Year"]
["Academic",{"$f":"VLOOKUP(CONCATENATE($B$4,\" \",$A20),'FTE Lookup'!$B$11:$L$115,5,0)","v":6527.5606349975478},{"$f":"VLOOKUP(CONCATENATE($B$4,\" \",$A20),'FTE Lookup'!$B$11:$L$115,8,0)","v":7035},{"$f":"C20-B20","v":507.43936500245218},{"$f":"IF(B20=0,0,(C20/B20)-1)","v":7.7737977994691176E-2},{"$f":"D20/10","v":50.743936500245219}]
["Vocational",{"$f":"VLOOKUP(CONCATENATE($B$4,\" \",$A21),'FTE Lookup'!$B$11:$L$115,5,0)","v":1780.3182040001259},{"$f":"VLOOKUP(CONCATENATE($B$4,\" \",$A21),'FTE Lookup'!$B$11:$L$115,8,0)","v":1919},{"$f":"C21-B21","v":138.68179599987411},{"$f":"IF(B21=0,0,(C21/B21)-1)","v":7.7897195955349829E-2},{"$f":"D21/10","v":13.86817959998741}]
["Basic Skills/Dev Ed",{"$f":"VLOOKUP(CONCATENATE($B$4,\" \",$A22),'FTE Lookup'!$B$11:$L$115,5,0)","v":957.10568800002738},{"$f":"VLOOKUP(CONCATENATE($B$4,\" \",$A22),'FTE Lookup'!$B$11:$L$115,8,0)","v":1031},{"$f":"C22-B22","v":73.894311999972615},{"$f":"IF(B22=0,0,(C22/B22)-1)","v":7.7206010711714068E-2},{"$f":"D22/10","v":7.3894311999972615}]
["TOTAL",{"$f":"SUM(B20:B22)","v":9264.9845269977013},{"$f":"SUM(C20:C22)","v":9985},{"$f":"C23-B23","v":720.01547300229868},{"$f":"IF(B23=0,0,(C23/B23)-1)","v":7.7713618506777715E-2},{"$f":"D23/10","v":72.001547300229873}]
[]
["* All funding sources, all ages, all intents (excluding community service), all enrollments (excluding DOC)"]
["Type 1 = Day On-Campus (excludes Online)"]
["Type 2 = Day On-Campus + Online"]
[]
[null,null,null,2021,"COMMITTED",2029,2024,2024,2024,2024,2029,"2023-25",null,"SHORTAGE AS %"]
[null,null,null,"SPACE","CHANGES","SPACE","ACADEMIC","VOCATIONAL","BASIC SKILLS","ONE TIME","CAM","SPACE DEFICITS",null,"OF 2023-25 CAM"]
{"$rows_left_out":31}
{"sheet":"Committed Changes","index":1,"n_rows":51,"n_cols":14,"rows_kept":51,"cut":false,"hidden":false,"merged":[[5,6,5,8],[5,9,5,10],[5,11,5,12]]}
[null,null,null,null,null,null,null,4,5,6,7,8,9,10]
[null,null,"Committed Changes (Colleges need to break out assignable areas in their projects by CAM Category before using this workbook)"]
[]
[null,null,"Buildings in 2021-23 major project pipeline as of July 12, 2021"]
[]
[null,null,null,null," ",null,"Gross Square Feet",null,null,"UFI",null,"Name",null,"Projected"]
[null,null,"College","Project Name","Number","2021-23 Phase","Total","Replaced by Project","Renovated in Project","To be Replaced","To be Renovated","To be Replaced","To be Renovated","Occupancy Date"]
[null,null,"Bates","Medical Mile Health Science Center",30000989,"Construction Reap",70000,64859,0,"A08982",null,"Bldg B",null,"2022-07-01"]
[null,null,"Bates","Fire Service Training Center ",40000130,"Construction",54700,0,0,null,null,null,null,"2023-02-01"]
[null,null,"Bellevue ","Center for Transdisciplinary Learning and Innovation ",40000168,"Construction",60000,0,0,null,null,null,null,"2023-01-01"]
[null,null,"Bellingham ","Engineering Technology Center - Bldg J Replacement ",40000256,"Design",21500,11558,0,"A03143",null,"J bldg",null,"2023-05-01"]
[null,null,"Big Bend","Professional-Technical Education Center",30000981,"Construction Reap",76140,76549,0,"A00116, A06829, A06920, A07007, A07326",null,"MAINTENANCE MECHANICS PRO, AG.EDUCATION&ENGINEERING, AUTO MECHANICS, AIRFRAME & POWERPLANT, WELDING LAB",null,"2019-12-01"]
[null,null,"Cascadia","CC5 Gateway Building ",40000222,"Design",61600,0,0,null,null,null,null,"2024-11-01"]
[null,null,"Centralia ","Teacher Education and Family Development Center ",40000109,"Design",18430,17430,0,"A03193, A04011, A04649, A08717, A02548",null,"217 Iron, CDC, FAM, HFL, CEN",null,"2024-06-01"]
[null,null,"Clark","North Clark County Satellite",30000135,"Construction",69000,0,0,null,null,null,null,"2023-10-01"]
[null,null,"Clark","Hanna Foster Hawkins Complex Replacement ",40000227,"Design",40940,35030,0,"A07210, A04633, A01409",null,"Foster Hall, Hanna Hall, Hawkins Hall",null,"2024-02-01"]
[null,null,"Clover Park","Center for Advanced Manufacturing Technologies",30000984,"Construction Reap",62478,59331,0,"A01800",null,"AUXILIARY SERVICES",null,"2019-08-01"]
[null,null,"Columbia Basin ","Performing Arts Building Replacement ",40000108,"Design",58668,37170,0,"A08055",null,"P Building",null,"2025-05-01"]
[null,null,"Edmonds ","Triton Learning Commons ",40000114,"Design",58650,0,5250,null,"A04627 (partial renovation)",null,"Lynnwood Hall","2025-07-01"]
[null,null,"Edmonds  ","Science Engineering Technology Bldg",30000137,"Construction Reap",69912,0,0,null,null,null,null,"2020-03-01"]
[null,null,"Everett","Learning Resource Center",30000136,"Construction",70000,0,0,null,null,null,null,"2023-01-01"]
[null,null,"Everett","Baker Hall Replacement ",40000190,"Design",50000,23710,0,"A10077",null,"Baker",null,"2023-01-01"]
[null,null,"Grays Harbor","Student Services and Instructional Building",30000127,"Construction",69985,35080,0,"A00146, A00079",null,"Hillier Union Building, Admin",null,"2022-10-01"]
[null,null,"Highline","Health and Life Sciences",30000983,"Construction Reap",46746,8119,30920,"A05054, A08640","A00349","FACULTY A BLDG, FACULTY B BLDG","MULTIPURPOSEB","2019-10-01"]
[null,null,"Highline ","Welcome Center for Student Success ",40000105,"Design",60315,54262,0,"A06008, A03870, A06104, A02946",null,"Building 6, Building 15, Building 18, Building 16",null,"2025-02-01"]
[null,null,"Lake Washington ","Center for Design ",40000102,"Construction",56500,0,0,null,null,null,null,"2023-01-01"]
[null,null,"Lower Columbia ","Center for Vocational and Transitional Studies ",40000106,"Design",54799,48795,0,"A09213, A03581, A03581, A01344",null,"Science, Vocational, Vocational addition, Physical Science",null,"2025-08-01"]
[null,null,"North Seattle","Library Building Renovation",30001451,"Construction",58177,0,58177,null,"A09018 (partial renovation)",null,"Library","2023-03-01"]
[null,null,"Olympic","College Instruction Center",30000122,"Construction Reap",75332,37320,0,"A02252, A04304, A09092, A10279",null,null,"THEATRE, MUSIC, ART A, ART B","2018-07-15"]
[null,null,"Olympic","Shop Building Renovation",30000986,"Construction Reap",21655,0,18510,null,"A08453",null,"Shop","2021-10-01"]
{"$rows_left_out":22}
{"sheet":"Inventory","index":2,"n_rows":49,"n_cols":36,"rows_kept":49,"cut":false,"hidden":false,"merged":[[6,25,6,30],[6,3,6,4],[6,5,6,9],[6,10,6,13],[6,14,6,15],[6,18,6,19],[6,20,6,23]]}
[null,null,1,2,3,4,5,6,7,8,9,10,11,12,13,14,15,16,17,18,19,20,21,22,23,24,25,26,27,28,29,30,31,32,33,35]
[null,"Inventory breakdown by room use (Colleges need to verify assignable area by CAM category before using this wookbook)"]
[null,"`"]
[null,"Owned Net Square Footage by Category Indicator"]
[null,"All data from SB Data Warehouse July 12, 2021"]
[]
[null,null,null,"Classroom",null,"Laboratory",null,null,null,null,"Fine Arts",null,null,null,"Vocational",null,"Learning & Study Support","Faculty Work and Related","Institutional Student Service Administration",null,"Student Social and Cultural Development",null,null,null,"Supplies, Facilities, Grounds","Non-program Support",null,null,null,null,null,"Community Relations","Self Support","Informal Learning","Coding Errors"]
[null,"DISTRICT","COLLEGE","A1","A2","B1","B2","B3","B4","B5","C1","C2","C3","C4","D1","D2","E1","F1","G1","G2","H1","H2","H3","H4","I1","J1","J2","J3","J4","J5","J6","K1","L1","M1","Z","TOTAL"]
[null,"280","Bates",32055,7890,672,7797,5093,0,2652,0,0,0,11570,162883,0,11796,44573,16991,2333,26461,0,0,7137,4510,1632,898,0,118630,1036,0,11161,0,0,95078,{"$f":"SUM(D9:AI9)","v":572848}]
[null,"080","Bellevue",100627,14065,38806,17984,4608,6663,2494,9064,9909,11805,2502,15268,2770,50125,51697,41813,9166,45503,796,38327,16199,33249,1400,23371,0,120444,4024,0,1571,2184,0,0,{"$f":"SUM(D10:AI10)","v":676434}]
[null,"250","Bellingham",23245,2620,0,6556,0,11697,0,0,0,0,4799,125791,0,14924,8560,13209,3118,14673,0,812,0,10494,0,0,0,60076,568,0,654,0,1431,3369,306596]
[null,"180","Big Bend",18807,2146,4574,803,3062,1892,1402,0,2057,4592,5642,115205,1214,20131,17143,13995,4110,31857,4000,24356,0,13582,0,1688,0,3004,1137,0,3426,0,0,19747,319572]
[null,"300","Cascadia",23529,0,6971,5195,0,3498,985,0,0,0,2268,0,0,2230,4543,18355,1433,6210,931,0,0,1844,0,0,2552,27621,50,0,0,0,13972,153877,276064]
[null,"121","Centralia",4419,48,0,0,35,42,0,670,835,1833,259,0,0,120,1409,3528,1224,301,0,0,0,0,0,0,0,5450,0,0,0,0,0,246487,266660]
[null,"140","Clark",114938,6439,53536,19627,7025,7945,1473,9231,10302,3831,13895,92149,847,32412,58055,66463,7373,43235,3441,29813,4882,22958,576,0,292,207978,1364,0,1946,0,2376,29,824431]
[null,"290","Clover Park",12113,4081,1125,21534,14255,0,0,0,0,0,0,255761,33541,12570,17201,27474,1307,41441,0,0,63,1855,3128,0,0,122676,6417,0,541,0,0,27184,604267]
[null,"190","Columbia Basin",102940,2252,28571,10020,6912,5305,3382,5809,3116,12034,7045,72013,4604,18986,70104,32536,7493,35696,848,42057,2312,33352,8301,1221,0,248028,6799,17281,3121,495,0,94305,886938]
[null,"230","Edmonds",59951,17490,28154,9243,4462,17955,2792,14377,6326,2953,4525,27011,14054,30230,46072,50518,8089,35243,4050,27195,5796,21980,0,0,0,66321,1921,0,5672,0,12830,0,525210]
[null,"050","Everett",35694,9004,41813,15542,4889,2277,28214,22228,4712,812,0,72257,13166,7170,53085,19034,2570,29756,1091,0,0,30211,0,8716,228,10665,6073,0,360,664,3927,76378,500536]
[null,"020","Grays Harbor",28462,0,775,0,864,6785,118,0,1653,12216,7285,58231,425,16087,11571,9020,404,17453,3080,14558,2522,18757,1360,2781,6262,25644,3927,0,818,0,0,60386,311444]
[null,"100","Green River",50104,10580,23291,11576,1528,6235,6090,0,3179,6670,3092,19565,1082,18955,14366,42690,5055,30645,971,27698,3533,12335,0,1129,0,124248,4195,0,711,0,0,113049,542572]
[null,"090","Highline",83640,0,20947,1395,1020,16466,1966,5267,4775,1104,3218,19809,2050,31351,31046,34186,6557,40536,690,42713,14162,25944,0,369,0,116019,20190,0,2071,0,1205,42946,571642]
[null,"260","Lake Washington",25680,5244,6168,14135,2493,0,3575,0,0,0,7366,145974,756,16273,13655,34976,4183,15886,212,5757,0,13135,0,832,2241,114268,17704,0,1117,1083,2984,4391,460088]
[null,"130","Lower Columbia",38728,8261,16417,2985,4801,5137,4285,3730,3347,7687,10333,59265,0,15705,22680,20024,878,2142,3032,22620,1497,18280,0,0,2802,17977,29111,15250,1124,0,546,7767,346411]
[null,"030","Olympic",56485,1653,18745,3368,124,20218,2940,9112,4028,4514,5965,42605,5018,28081,23110,35823,3697,26039,1230,30160,3440,12269,0,1077,221,116143,11342,0,1064,0,2870,31139,502480]
[null,"010","Peninsula",39455,930,13813,5022,0,2067,1007,6648,2840,1406,9964,19629,0,23178,17028,21725,2641,16300,1570,15436,0,15423,0,0,0,73848,502,0,2573,3305,1785,0,298095]
[null,"111","Pierce FS",69749,1207,17992,870,5818,4834,1350,0,6496,5202,3347,28112,1630,43167,25581,38703,12015,27454,3269,26373,6869,21232,0,820,224,39376,220,0,1820,0,0,560,394290]
[null,"112","Pierce PY",36021,0,8795,11209,3034,2279,0,2488,2216,7411,6544,8147,0,17039,10993,14607,3674,25433,3800,9299,5930,4441,0,0,0,29487,0,0,0,0,0,0,212847]
[null,"270","Renton",8240,11512,1591,12475,25549,7326,0,0,0,0,3920,190937,0,17008,15253,25929,2589,24384,0,503,6136,9108,0,0,0,60181,4718,0,640,0,0,11077,439076]
[null,"062","Seattle Central",94429,7751,13143,14003,4975,17044,1620,10630,3422,8823,6738,134703,0,45983,54973,95003,2099,37641,8572,31833,4692,45314,14287,0,0,227650,36729,0,1031,0,4356,7820,935264]
{"$rows_left_out":20}
{"sheet":"CAM Allowances","index":3,"n_rows":28,"n_cols":9,"rows_kept":28,"cut":false,"hidden":false,"merged":[[2,1,2,8],[11,3,11,8],[12,3,12,8],[13,3,13,8],[21,3,21,8],[5,1,6,1],[5,2,6,2],[5,3,5,4],[5,5,5,6],[5,7,5,8],[26,1,26,8],[27,1,27,8],[4,1,4,8],[22,1,22,8],[25,1,25,8],[23,2,23,8],[24,2,24,8]]}
[]
[]
[null,"Capital Asset Model, adopted February 7, 2013"]
[]
[null,"Assignable Square Feet per FTE Student"]
[null,"Type of Space","FTE Type","Academic FTE",null,"Vocational FTE",null,"Basic Skills FTE"]
[null,null,null,"First 1,000","Additional","First 1,000","Additional","First 1,000","Additional"]
[null,"General Classroom",1,12.4,12.4,7.5,7.5,"N/A","N/A"]
[null,"Basic Skills",2,"N/A","N/A","N/A","N/A",27.6,27.6]
[null,"Science Lab",1,6,6,3.5,3.5,"N/A","N/A"]
[null,"Computer Lab (open)",2,3.2,3.2,3.2,3.2,3.2,3.2]
[null,"Music",2,"A one-time allowance of 4,000 asf @ CCs only"]
[null,"Art",2,"A one-time allowance of 6,000 asf @ CCs only"]
[null,"Drama",2,"A one-time allowance of 5,000 asf @ CCs only"]
[null,"Physical Education **",2,26,10,"N/A","N/A","N/A","N/A"]
[null,"Library ***",2,16.8,8.5,16.8,8.5,16.8,8.5]
[null,"Faculty Office",2,8.1,8.1,10.8,10.8,8.1,8.1]
[null,"Admin/Student Services",2,8.98,5.13,8.98,5.13,8.98,5.13]
[null,"Student Center & Related",2,13.19,7.97,13.19,7.97,13.19,7.97]
[null,"Childcare",2,3.4,3.4,3.4,3.4,3.4,3.4]
[null,"Central Stores/Maintenance",2,7,4,4,4,7,4]
[null,"Auditorium",2,"A one-time, total space of 9,000 asf @ CCs and TCs"]
[]
[null,"FTE Type 1:","Day On Campus w/o Online (Category 3N)."]
[null,"FTE Type 2:","Day On Campus plus Online of same intent regardless of time of day."]
[]
[null,"* Vocational space will be included in the CAM based on a formal analysis of space needs by program and projected enrollment growth."]
[null,"** Calculation based on first 500 FTE."]

{"sheet":"FTE Lookup","index":4,"n_rows":112,"n_cols":12,"rows_kept":112,"cut":false,"hidden":false,"merged":[[8,3,8,5],[8,6,8,8],[8,9,8,11]]}
[null,1,2,3,4,5,6,7,8,9,10,11]
[]
[null,null,"WA State Board for Community and Technical Colleges"]
[null,null,"Summary of Fall FTEs Used in the 2023-25 CAM"]
[null,null,"CAM V01"]
[null,null,"EXCLUDING Department of Corrections (DOC)"]
[null,null,"Type 1 = Day On-Campus (excludes Online)"]
[null,null,"Type 2 = Day On-Campus + Online"]
[null,"Lookup","010","Fall 2019 FTEs",null,null,"Fall 2029 FTE Projections",null,null,"FTE Growth (Fall)"]
[null,"College","Intent","Total","Type 1","Type 2","Total","Type 1","Type 2","Total","Type 1","Type 2"]
[null,"Bates Academic","Academic",164.06650200000064,90.666575999999978,164.06650200000064,177,98,177,12.933497999999361,7.3334240000000221,12.933497999999361]
[null,"Bates Vocational","Vocational",3027.3299420000244,1250.5517170000446,1567.3513570000641,3258,1346,1687,230.6700579999756,95.448282999955381,119.64864299993587]
[null,"Bates Basic Skills/Dev Ed","Basic Skills/Dev Ed",186.42645400000129,158.7731550000004,186.42645400000129,201,171,201,14.573545999998714,12.226844999999599,14.573545999998714]
[null,"Bellevue Academic","Academic",6970.5602789970162,4784.0955459997012,6527.5606349975478,7512,5156,7035,541.43972100298379,371.90445400029876,507.43936500245218]
[null,"Bellevue Vocational","Vocational",2275.9844820001485,1113.0522500000552,1780.3182040001259,2453,1200,1919,177.01551799985145,86.94774999994479,138.68179599987411]
[null,"Bellevue Basic Skills/Dev Ed","Basic Skills/Dev Ed",1246.3054120000372,890.90575700002489,957.10568800002738,1343,960,1031,96.694587999962778,69.094242999975108,73.894311999972615]
[null,"Bellingham Academic","Academic",428.99957099999421,237.66642900000269,381.99961799999676,462,256,411,33.000429000005795,18.333570999997306,29.000382000003242]
[null,"Bellingham Vocational","Vocational",1447.6314680000492,1040.46536500002,1162.5985200000334,1557,1119,1250,109.36853199995085,78.534634999979971,87.401479999966568]
[null,"Bellingham Basic Skills/Dev Ed","Basic Skills/Dev Ed",222.67305500000126,183.81980700000074,197.81979300000117,240,198,213,17.326944999998744,14.180192999999264,15.18020699999883]
[null,"Big Bend Academic","Academic",1010.5988900000572,719.86582400001896,970.46560000005195,1146,816,1100,135.40110999994283,96.134175999981039,129.53439999994805]
[null,"Big Bend Vocational","Vocational",587.07251199999155,367.0395199999964,429.23944199999335,666,416,487,78.927488000008452,48.960480000003599,57.760558000006654]
[null,"Big Bend Basic Skills/Dev Ed","Basic Skills/Dev Ed",380.92626799999766,231.69975200000147,254.1530560000017,432,263,288,51.073732000002337,31.300247999998533,33.846943999998302]
[null,"Cascadia Academic","Academic",2315.8644440001931,1528.7985570001017,1861.1315580001412,2556,1687,2054,240.13555599980691,158.20144299989829,192.86844199985876]
[null,"Cascadia Vocational","Vocational",160.53312300000027,60.199926000000247,92.333193999999878,177,66,102,16.466876999999727,5.8000739999997535,9.6668060000001219]
[null,"Cascadia Basic Skills/Dev Ed","Basic Skills/Dev Ed",321.1997580000002,234.6664440000024,234.6664440000024,355,259,259,33.800241999999798,24.3335559999976,24.3335559999976]
[null,"Centralia Academic","Academic",1100.1986660000628,774.9324600000225,990.26559200004999,1171,825,1054,70.801333999937242,50.067539999977498,63.734407999950008]
[null,"Centralia Vocational","Vocational",753.37251600001059,488.68621299999126,566.01946499999508,802,520,603,48.627483999989408,31.313787000008745,36.98053500000492]
[null,"Centralia Basic Skills/Dev Ed","Basic Skills/Dev Ed",302.88633499999935,215.17976100000058,235.17974200000072,322,229,250,19.113665000000651,13.820238999999418,14.820257999999285]
[null,"Clark Academic","Academic",4835.3839999994834,3334,1231.6780000000554,5238,3612,1334,402.61600000051658,278,102.32199999994464]
[null,"Clark Vocational","Vocational",1534.3530000001065,1024,325.60799999999466,1662,1109,353,127.64699999989352,85,27.392000000005339]
{"$rows_left_out":83}
{"sheet":"College Name Lookup","index":5,"n_rows":36,"n_cols":6,"rows_kept":36,"cut":false,"hidden":false,"merged":[]}
["COL","TITLE",null,"COL","TITLE","TYPE"]
["010","Peninsula",null,"280","Bates","Technical College"]
["020","Grays Harbor",null,"080","Bellevue","Community College"]
["030","Olympic",null,"250","Bellingham","Technical College"]
["040","Skagit Valley",null,"180","Big Bend","Community College"]
["050","Everett",null,"300","Cascadia","Community College"]
["062","Seattle Central",null,"121","Centralia","Community College"]
["063","Seattle North",null,"140","Clark","Community College"]
["064","Seattle South",null,"290","Clover Park","Technical College"]
["065","Seattle Voc Institute",null,"190","Columbia Basin","Community College"]
["070","Shoreline",null,"230","Edmonds","Community College"]
["080","Bellevue",null,"050","Everett","Community College"]
["090","Highline",null,"020","Grays Harbor","Community College"]
["100","Green River",null,"100","Green River","Community College"]
["111","Pierce Fort Steilacoom",null,"090","Highline","Community College"]
["112","Pierce Puyallup",null,"260","Lake Washington","Technical College"]
["121","Centralia",null,"130","Lower Columbia","Community College"]
["130","Lower Columbia",null,"030","Olympic","Community College"]
["140","Clark",null,"010","Peninsula","Community College"]
["150","Wenatchee Valley",null,"111","Pierce Fort Steilacoom","Community College"]
["160","Yakima Valley",null,"112","Pierce Puyallup","Community College"]
["171","Spokane",null,"270","Renton","Technical College"]
["172","Spokane Falls",null,"062","Seattle Central","Community College"]
["180","Big Bend",null,"063","Seattle North","Community College"]
["190","Columbia Basin",null,"064","Seattle South","Community College"]
["200","Walla Walla",null,"065","Seattle Voc Institute","Technical College"]
["210","Whatcom",null,"070","Shoreline","Community College"]
["220","Tacoma",null,"040","Skagit Valley","Community College"]
["230","Edmonds",null,"240","South Puget Sound","Community College"]
["240","South Puget Sound",null,"171","Spokane","Community College"]
{"$rows_left_out":6}